{"text_format":"1","workbook":"xlsx","n_sheets":22,"sheets":["Title","General Variables","Materials","Start","1-Alfalfa","2-Alfalfa","3-Alfalfa","4-Alfalfa","5-Alfalfa","6-Alfalfa","7-Alfalfa","8-Alfalfa","9-Alfalfa","10-Alfalfa","11-Alfalfa","12-Alfalfa","13-Alfalfa","14-Alfalfa","Stop","Crop after Crop Data","Formulas","Depreciation Graph"],"not_rendered":{"charts":1,"images":2,"macros":1,"external_links":1,"defined_names":34,"comments":0,"pivot_tables":0},"unopened":[],"bounds":{"document_bytes":16777216,"sheet_cells":100000,"rows_first":2000,"rows_last":500,"rows_between":2000,"halvings":0,"cell_chars":16384,"cell_head_chars":4096},"cells_cut":0,"cells_raw":0,"read":"whole","date_system":"1900"}

{"sheet":"Title","index":0,"n_rows":47,"n_cols":7,"rows_kept":47,"cut":false,"hidden":false,"merged":[]}
[]
[]
[]
[]
[]
[]
{"$rows_left_out":42}
{"sheet":"General Variables","index":1,"n_rows":99,"n_cols":14,"rows_kept":99,"cut":false,"hidden":false,"merged":[[45,3,45,4],[61,3,61,4],[52,3,52,4],[53,3,53,4],[54,3,54,4],[55,3,55,4],[56,3,56,4],[57,3,57,4],[39,3,39,4],[0,0,0,8],[58,3,58,4],[59,3,59,4],[60,3,60,4],[46,3,46,4],[47,3,47,4],[48,3,48,4],[49,3,49,4],[50,3,50,4],[51,3,51,4],[40,3,40,4],[41,3,41,4],[42,3,42,4],[43,3,43,4],[44,3,44,4]]}
["Farm Wide Inputs"]
[]
["Year",2017,null,null,"Real Estate Values"]
["Wage Rate",20,"/ Hr",null,"Description","Value"]
["Diesel Price",2.25,"/ gal",null,"Dryland (State)",3470]
["Lube Factor",1.1499999999999999,null,null,"Dryland (Panhandle)",745]
{"$rows_left_out":94}
{"sheet":"Materials","index":2,"n_rows":136,"n_cols":8,"rows_kept":136,"cut":false,"hidden":false,"merged":[]}
["Index","Material","Category","Purchase Price","Purchase Unit","Applied Unit","Applied Units / Purchased Units","Applied Price"]
[1,"21-0-0-24S   ","Additive",0.35,"pound","pound",1,{"$f":"IF(G2=0,0,D2/G2)","v":0.35}]
[2,"Crop Oil Concentrate","Additive",9,"gallon","pint",8,{"$f":"IF(G3=0,0,D3/G3)","v":1.125}]
[3,"NIS","Additive",16,"gallon","ounce",128,{"$f":"IF(G4=0,0,D4/G4)","v":0.125}]
[4,"UAN","Additive",1.5,"gallon","pint",8,{"$f":"IF(G5=0,0,D5/G5)","v":0.1875}]
[5,"Aerial Spray","Custom",10,"acre","acre",1,10]
{"$rows_left_out":131}
{"sheet":"Start","index":3,"n_rows":0,"n_cols":0,"rows_kept":0,"cut":false,"hidden":true,"merged":[]}

{"sheet":"1-Alfalfa","index":4,"n_rows":244,"n_cols":15,"rows_kept":244,"cut":false,"hidden":false,"merged":[[6,0,6,11],[9,1,10,1],[9,2,10,2],[9,4,10,4],[9,5,10,5],[9,6,9,7],[9,10,10,10],[9,11,10,11],[9,8,9,9],[34,5,35,5],[34,6,35,6],[34,7,34,8],[34,9,35,9],[34,11,35,11],[57,2,57,4],[58,2,58,4],[47,2,47,4],[36,2,36,4],[37,2,37,4],[38,2,38,4],[39,2,39,4],[40,2,40,4],[41,2,41,4],[42,2,42,4],[43,2,43,4],[44,2,44,4],[45,2,45,4],[46,2,46,4],[4,0,4,11],[59,2,59,4],[70,6,70,7],[48,2,48,4],[49,2,49,4],[50,2,50,4],[51,2,51,4],[52,2,52,4],[53,2,53,4],[54,2,54,4],[60,2,60,4],[65,5,65,6],[69,2,69,4],[69,6,69,7],[55,2,55,4],[56,2,56,4]]}
[]
[{"$f":"REPLACE(CELL(\"filename\",A1),1,FIND(\"]\",CELL(\"filename\",A1)),\"\")","v":"1-Alfalfa"},null,null,null,null,null,null,null,"Dryland",null,null,{"$f":"'General Variables'!A3&\" \"&'General Variables'!B3","v":"Year 2017"},null,null,"Acre"]
["Fall Establishment",null,null,null,null,null,null,null,"acre/inches",null,null,null,null,null,"ai"]
[null,null,null,null,null,null,null,null,null,"Does Crop Follow a Legume? ",null,null,null,null,{"$f":"B4","v":0}]
[{"$f":" A2  & IF(C2=\"\",\"\",  \", \" &C2 ) & \", \" & A3 & \", \" & I2","v":"1-Alfalfa, Fall Establishment, Dryland"}]
[]
{"$rows_left_out":239}
{"sheet":"2-Alfalfa","index":5,"n_rows":244,"n_cols":15,"rows_kept":244,"cut":false,"hidden":false,"merged":[[65,5,65,6],[69,2,69,4],[69,6,69,7],[70,6,70,7],[55,2,55,4],[56,2,56,4],[57,2,57,4],[58,2,58,4],[59,2,59,4],[60,2,60,4],[54,2,54,4],[43,2,43,4],[44,2,44,4],[45,2,45,4],[46,2,46,4],[47,2,47,4],[48,2,48,4],[49,2,49,4],[50,2,50,4],[51,2,51,4],[52,2,52,4],[53,2,53,4],[42,2,42,4],[34,5,35,5],[34,6,35,6],[34,7,34,8],[34,9,35,9],[37,2,37,4],[38,2,38,4],[39,2,39,4],[40,2,40,4],[41,2,41,4],[4,0,4,11],[34,11,35,11],[36,2,36,4],[6,0,6,11],[9,1,10,1],[9,2,10,2],[9,4,10,4],[9,5,10,5],[9,6,9,7],[9,8,9,9],[9,10,10,10],[9,11,10,11]]}
[]
[{"$f":"REPLACE(CELL(\"filename\",A1),1,FIND(\"]\",CELL(\"filename\",A1)),\"\")","v":"2-Alfalfa"},null,"Roundup Ready® No-Till",null,null,null,null,null,"Dryland",null,null,{"$f":"'General Variables'!A3&\" \"&'General Variables'!B3","v":"Year 2017"},null,null,"Acre"]
["Fall Establishment",null,null,null,null,null,null,null,"acre/inches",null,null,null,null,null,"ai"]
[null,null,null,null,null,null,null,null,null,"Does Crop Follow a Legume? ",null,null,null,null,{"$f":"B4","v":0}]
[{"$f":" A2  & IF(C2=\"\",\"\",  \", \" &C2 ) & \", \" & A3 & \", \" & I2","v":"2-Alfalfa, Roundup Ready® No-Till, Fall Establishment, Dryland"}]
[]
{"$rows_left_out":239}
{"sheet":"3-Alfalfa","index":6,"n_rows":244,"n_cols":15,"rows_kept":244,"cut":false,"hidden":false,"merged":[[65,5,65,6],[69,2,69,4],[69,6,69,7],[70,6,70,7],[55,2,55,4],[56,2,56,4],[57,2,57,4],[58,2,58,4],[59,2,59,4],[60,2,60,4],[54,2,54,4],[43,2,43,4],[44,2,44,4],[45,2,45,4],[46,2,46,4],[47,2,47,4],[48,2,48,4],[49,2,49,4],[50,2,50,4],[51,2,51,4],[52,2,52,4],[53,2,53,4],[42,2,42,4],[34,5,35,5],[34,6,35,6],[34,7,34,8],[34,9,35,9],[37,2,37,4],[38,2,38,4],[39,2,39,4],[40,2,40,4],[41,2,41,4],[4,0,4,11],[34,11,35,11],[36,2,36,4],[6,0,6,11],[9,1,10,1],[9,2,10,2],[9,4,10,4],[9,5,10,5],[9,6,9,7],[9,8,9,9],[9,10,10,10],[9,11,10,11]]}
[]
[{"$f":"REPLACE(CELL(\"filename\",A1),1,FIND(\"]\",CELL(\"filename\",A1)),\"\")","v":"3-Alfalfa"},null,"Roundup Ready®",null,null,null,null,null,"Dryland",null,null,{"$f":"'General Variables'!A3&\" \"&'General Variables'!B3","v":"Year 2017"},null,null,"Acre"]
["Fall Establishment",null,null,null,null,null,null,null,"acre/inches",null,null,null,null,null,"ai"]
[null,null,null,null,null,null,null,null,null,"Does Crop Follow a Legume? ",null,null,null,null,{"$f":"B4","v":0}]
[{"$f":" A2  & IF(C2=\"\",\"\",  \", \" &C2 ) & \", \" & A3 & \", \" & I2","v":"3-Alfalfa, Roundup Ready®, Fall Establishment, Dryland"}]
[]
{"$rows_left_out":239}
{"sheet":"4-Alfalfa","index":7,"n_rows":244,"n_cols":15,"rows_kept":244,"cut":false,"hidden":false,"merged":[[6,0,6,11],[9,1,10,1],[9,2,10,2],[9,4,10,4],[9,5,10,5],[9,6,9,7],[9,10,10,10],[9,11,10,11],[9,8,9,9],[34,5,35,5],[34,6,35,6],[34,7,34,8],[34,9,35,9],[34,11,35,11],[57,2,57,4],[58,2,58,4],[47,2,47,4],[36,2,36,4],[37,2,37,4],[38,2,38,4],[39,2,39,4],[40,2,40,4],[41,2,41,4],[42,2,42,4],[43,2,43,4],[44,2,44,4],[45,2,45,4],[46,2,46,4],[4,0,4,11],[59,2,59,4],[70,6,70,7],[48,2,48,4],[49,2,49,4],[50,2,50,4],[51,2,51,4],[52,2,52,4],[53,2,53,4],[54,2,54,4],[60,2,60,4],[65,5,65,6],[69,2,69,4],[69,6,69,7],[55,2,55,4],[56,2,56,4]]}
[]
[{"$f":"REPLACE(CELL(\"filename\",A1),1,FIND(\"]\",CELL(\"filename\",A1)),\"\")","v":"4-Alfalfa"},null,null,null,null,null,null,null,"Dryland",null,null,{"$f":"'General Variables'!A3&\" \"&'General Variables'!B3","v":"Year 2017"},null,null,"Acre"]
["Establish Spring Seed with Herbicides",null,null,null,null,null,null,null,"acre/inches",null,null,null,null,null,"ai"]
[2.8,"ton",null,null,null,null,null,null,null,"Does Crop Follow a Legume? ",null,null,null,null,{"$f":"B4","v":"ton"}]
[{"$f":" A2  & IF(C2=\"\",\"\",  \", \" &C2 ) & \", \" & A3 & \", \" & I2","v":"4-Alfalfa, Establish Spring Seed with Herbicides, Dryland"}]
[]
{"$rows_left_out":239}
{"sheet":"5-Alfalfa","index":8,"n_rows":244,"n_cols":15,"rows_kept":244,"cut":false,"hidden":false,"merged":[[65,5,65,6],[69,2,69,4],[69,6,69,7],[70,6,70,7],[55,2,55,4],[56,2,56,4],[57,2,57,4],[58,2,58,4],[59,2,59,4],[60,2,60,4],[54,2,54,4],[43,2,43,4],[44,2,44,4],[45,2,45,4],[46,2,46,4],[47,2,47,4],[48,2,48,4],[49,2,49,4],[50,2,50,4],[51,2,51,4],[52,2,52,4],[53,2,53,4],[42,2,42,4],[34,5,35,5],[34,6,35,6],[34,7,34,8],[34,9,35,9],[37,2,37,4],[38,2,38,4],[39,2,39,4],[40,2,40,4],[41,2,41,4],[4,0,4,11],[34,11,35,11],[36,2,36,4],[6,0,6,11],[9,1,10,1],[9,2,10,2],[9,4,10,4],[9,5,10,5],[9,6,9,7],[9,8,9,9],[9,10,10,10],[9,11,10,11]]}
[]
[{"$f":"REPLACE(CELL(\"filename\",A1),1,FIND(\"]\",CELL(\"filename\",A1)),\"\")","v":"5-Alfalfa"},null,"Roundup Ready®",null,null,null,null,null,"Dryland",null,null,{"$f":"'General Variables'!A3&\" \"&'General Variables'!B3","v":"Year 2017"},null,null,"Acre"]
["Establish Spring Seed",null,null,null,null,null,null,null,"acre/inches",null,null,null,null,null,"ai"]
[2.8,"ton",null,null,null,null,null,null,null,"Does Crop Follow a Legume? ",null,null,null,null,{"$f":"B4","v":"ton"}]
[{"$f":" A2  & IF(C2=\"\",\"\",  \", \" &C2 ) & \", \" & A3 & \", \" & I2","v":"5-Alfalfa, Roundup Ready®, Establish Spring Seed, Dryland"}]
[]
{"$rows_left_out":239}
{"sheet":"6-Alfalfa","index":9,"n_rows":244,"n_cols":15,"rows_kept":244,"cut":false,"hidden":false,"merged":[[6,0,6,11],[9,1,10,1],[9,2,10,2],[9,4,10,4],[9,5,10,5],[9,6,9,7],[9,10,10,10],[9,11,10,11],[9,8,9,9],[34,5,35,5],[34,6,35,6],[34,7,34,8],[34,9,35,9],[34,11,35,11],[57,2,57,4],[58,2,58,4],[47,2,47,4],[36,2,36,4],[37,2,37,4],[38,2,38,4],[39,2,39,4],[40,2,40,4],[41,2,41,4],[42,2,42,4],[43,2,43,4],[44,2,44,4],[45,2,45,4],[46,2,46,4],[4,0,4,11],[59,2,59,4],[70,6,70,7],[48,2,48,4],[49,2,49,4],[50,2,50,4],[51,2,51,4],[52,2,52,4],[53,2,53,4],[54,2,54,4],[60,2,60,4],[65,5,65,6],[69,2,69,4],[69,6,69,7],[55,2,55,4],[56,2,56,4]]}
[]
[{"$f":"REPLACE(CELL(\"filename\",A1),1,FIND(\"]\",CELL(\"filename\",A1)),\"\")","v":"6-Alfalfa"},null,null,null,null,null,null,null,"Pivot Irrigated"," 800 GPM 35 PSI",null,{"$f":"'General Variables'!A3&\" \"&'General Variables'!B3","v":"Year 2017"},null,null,"Acre"]
["Establish Spring Seed with Herbicides",null,null,null,null,null,null,12,"acre/inches",null,null,null,null,null,"ai"]
[3.8,"ton",null,null,null,null,null,null,null,"Does Crop Follow a Legume? ",null,null,null,null,{"$f":"B4","v":"ton"}]
[{"$f":" A2  & IF(C2=\"\",\"\",  \", \" &C2 ) & \", \" & A3 & \", \" & I2","v":"6-Alfalfa, Establish Spring Seed with Herbicides, Pivot Irrigated"}]
[]
{"$rows_left_out":239}
{"sheet":"7-Alfalfa","index":10,"n_rows":244,"n_cols":15,"rows_kept":244,"cut":false,"hidden":false,"merged":[[65,5,65,6],[69,2,69,4],[69,6,69,7],[70,6,70,7],[55,2,55,4],[56,2,56,4],[57,2,57,4],[58,2,58,4],[59,2,59,4],[60,2,60,4],[54,2,54,4],[43,2,43,4],[44,2,44,4],[45,2,45,4],[46,2,46,4],[47,2,47,4],[48,2,48,4],[49,2,49,4],[50,2,50,4],[51,2,51,4],[52,2,52,4],[53,2,53,4],[42,2,42,4],[34,5,35,5],[34,6,35,6],[34,7,34,8],[34,9,35,9],[37,2,37,4],[38,2,38,4],[39,2,39,4],[40,2,40,4],[41,2,41,4],[4,0,4,11],[34,11,35,11],[36,2,36,4],[6,0,6,11],[9,1,10,1],[9,2,10,2],[9,4,10,4],[9,5,10,5],[9,6,9,7],[9,8,9,9],[9,10,10,10],[9,11,10,11]]}
[]
[{"$f":"REPLACE(CELL(\"filename\",A1),1,FIND(\"]\",CELL(\"filename\",A1)),\"\")","v":"7-Alfalfa"},null,"Roundup Ready®",null,null,null,null,null,"Pivot Irrigated","800 GPM 35 PSI",null,{"$f":"'General Variables'!A3&\" \"&'General Variables'!B3","v":"Year 2017"},null,null,"Acre"]
["Establish Spring Seed",null,null,null,null,null,null,12,"acre/inches",null,null,null,null,null,"ai"]
[4,"ton",null,null,null,null,null,null,null,"Does Crop Follow a Legume? ",null,null,null,null,{"$f":"B4","v":"ton"}]
[{"$f":" A2  & IF(C2=\"\",\"\",  \", \" &C2 ) & \", \" & A3 & \", \" & I2","v":"7-Alfalfa, Roundup Ready®, Establish Spring Seed, Pivot Irrigated"}]
[]
{"$rows_left_out":239}
{"sheet":"8-Alfalfa","index":11,"n_rows":244,"n_cols":15,"rows_kept":244,"cut":false,"hidden":false,"merged":[[6,0,6,11],[9,1,10,1],[9,2,10,2],[9,4,10,4],[9,5,10,5],[9,6,9,7],[9,10,10,10],[9,11,10,11],[9,8,9,9],[34,5,35,5],[34,6,35,6],[34,7,34,8],[34,9,35,9],[34,11,35,11],[57,2,57,4],[58,2,58,4],[47,2,47,4],[36,2,36,4],[37,2,37,4],[38,2,38,4],[39,2,39,4],[40,2,40,4],[41,2,41,4],[42,2,42,4],[43,2,43,4],[44,2,44,4],[45,2,45,4],[46,2,46,4],[4,0,4,11],[59,2,59,4],[70,6,70,7],[48,2,48,4],[49,2,49,4],[50,2,50,4],[51,2,51,4],[52,2,52,4],[53,2,53,4],[54,2,54,4],[60,2,60,4],[65,5,65,6],[69,2,69,4],[69,6,69,7],[55,2,55,4],[56,2,56,4]]}
[]
[{"$f":"REPLACE(CELL(\"filename\",A1),1,FIND(\"]\",CELL(\"filename\",A1)),\"\")","v":"8-Alfalfa"},null,null,null,null,null,null,null,"Gravity Irrigated, Canal",null,null,{"$f":"'General Variables'!A3&\" \"&'General Variables'!B3","v":"Year 2017"},null,null,"Acre"]
["Fall Seeded with Subsequent Year Production",null,null,null,null,null,null,18,"acre/inches",null,null,null,null,null,"ai"]
[2.5,"ton",null,null,null,null,null,null,null,"Does Crop Follow a Legume? ",null,null,null,null,{"$f":"B4","v":"ton"}]
[{"$f":" A2  & IF(C2=\"\",\"\",  \", \" &C2 ) & \", \" & A3 & \", \" & I2","v":"8-Alfalfa, Fall Seeded with Subsequent Year Production, Gravity Irrigated, Canal"}]
[]
{"$rows_left_out":239}
{"sheet":"9-Alfalfa","index":12,"n_rows":244,"n_cols":15,"rows_kept":244,"cut":false,"hidden":false,"merged":[[6,0,6,11],[9,1,10,1],[9,2,10,2],[9,4,10,4],[9,5,10,5],[9,6,9,7],[9,10,10,10],[9,11,10,11],[9,8,9,9],[34,5,35,5],[34,6,35,6],[34,7,34,8],[34,9,35,9],[34,11,35,11],[57,2,57,4],[58,2,58,4],[47,2,47,4],[36,2,36,4],[37,2,37,4],[38,2,38,4],[39,2,39,4],[40,2,40,4],[41,2,41,4],[42,2,42,4],[43,2,43,4],[44,2,44,4],[45,2,45,4],[46,2,46,4],[4,0,4,11],[59,2,59,4],[70,6,70,7],[48,2,48,4],[49,2,49,4],[50,2,50,4],[51,2,51,4],[52,2,52,4],[53,2,53,4],[54,2,54,4],[60,2,60,4],[65,5,65,6],[69,2,69,4],[69,6,69,7],[55,2,55,4],[56,2,56,4]]}
[]
[{"$f":"REPLACE(CELL(\"filename\",A1),1,FIND(\"]\",CELL(\"filename\",A1)),\"\")","v":"9-Alfalfa"},null,null,null,null,null,null,null,"Dryland",null,null,{"$f":"'General Variables'!A3&\" \"&'General Variables'!B3","v":"Year 2017"},null,null,"Acre"]
["Large Round Bale",null,null,null,null,null,null,null,"acre/inches",null,null,null,null,null,"ai"]
[4.4000000000000004,"ton",null,null,null,null,null,null,null,"Does Crop Follow a Legume? ",null,null,null,null,{"$f":"B4","v":"ton"}]
[{"$f":" A2  & IF(C2=\"\",\"\",  \", \" &C2 ) & \", \" & A3 & \", \" & I2","v":"9-Alfalfa, Large Round Bale, Dryland"}]
[]
{"$rows_left_out":239}
{"sheet":"10-Alfalfa","index":13,"n_rows":244,"n_cols":15,"rows_kept":244,"cut":false,"hidden":false,"merged":[[42,2,42,4],[6,0,6,11],[9,1,10,1],[9,2,10,2],[9,4,10,4],[9,5,10,5],[9,6,9,7],[9,10,10,10],[9,11,10,11],[9,8,9,9],[34,11,35,11],[36,2,36,4],[37,2,37,4],[38,2,38,4],[70,6,70,7],[65,5,65,6],[69,2,69,4],[69,6,69,7],[49,2,49,4],[50,2,50,4],[51,2,51,4],[52,2,52,4],[53,2,53,4],[54,2,54,4],[60,2,60,4],[55,2,55,4],[57,2,57,4],[58,2,58,4],[4,0,4,11],[59,2,59,4],[56,2,56,4],[43,2,43,4],[44,2,44,4],[45,2,45,4],[46,2,46,4],[47,2,47,4],[48,2,48,4],[39,2,39,4],[34,5,35,5],[34,6,35,6],[34,7,34,8],[34,9,35,9],[40,2,40,4],[41,2,41,4]]}
[]
[{"$f":"REPLACE(CELL(\"filename\",A1),1,FIND(\"]\",CELL(\"filename\",A1)),\"\")","v":"10-Alfalfa"},null,null,null,null,null,null,null,"Pivot Irrigated","800 GPM 35 PSI",null,{"$f":"'General Variables'!A3&\" \"&'General Variables'!B3","v":"Year 2017"},null,null,"Acre"]
["Large and Small Square Bale",null,null,null,null,null,null,16,"acre/inches",null,null,null,null,null,"ai"]
[6.7,"ton",null,null,null,null,null,null,null,"Does Crop Follow a Legume? ",null,null,null,null,{"$f":"B4","v":"ton"}]
[{"$f":" A2  & IF(C2=\"\",\"\",  \", \" &C2 ) & \", \" & A3 & \", \" & I2","v":"10-Alfalfa, Large and Small Square Bale, Pivot Irrigated"}]
[]
{"$rows_left_out":239}
{"sheet":"11-Alfalfa","index":14,"n_rows":244,"n_cols":15,"rows_kept":244,"cut":false,"hidden":false,"merged":[[60,2,60,4],[70,6,70,7],[65,5,65,6],[69,2,69,4],[69,6,69,7],[55,2,55,4],[56,2,56,4],[57,2,57,4],[58,2,58,4],[59,2,59,4],[54,2,54,4],[43,2,43,4],[44,2,44,4],[45,2,45,4],[46,2,46,4],[47,2,47,4],[48,2,48,4],[49,2,49,4],[50,2,50,4],[51,2,51,4],[52,2,52,4],[53,2,53,4],[42,2,42,4],[34,5,35,5],[34,6,35,6],[34,7,34,8],[34,9,35,9],[37,2,37,4],[38,2,38,4],[39,2,39,4],[40,2,40,4],[41,2,41,4],[4,0,4,11],[34,11,35,11],[36,2,36,4],[6,0,6,11],[9,1,10,1],[9,2,10,2],[9,4,10,4],[9,5,10,5],[9,6,9,7],[9,8,9,9],[9,10,10,10],[9,11,10,11]]}
[]
[{"$f":"REPLACE(CELL(\"filename\",A1),1,FIND(\"]\",CELL(\"filename\",A1)),\"\")","v":"11-Alfalfa"},null,"Roundup Ready®",null,null,null,null,null,"Pivot Irrigated","800 GPM 35 PSI",null,{"$f":"'General Variables'!A3&\" \"&'General Variables'!B3","v":"Year 2017"},null,null,"Acre"]
["Large and Small Square Bale",null,null,null,null,null,null,16,"acre/inches",null,null,null,null,null,"ai"]
[6.8,"ton",null,null,null,null,null,null,null,"Does Crop Follow a Legume? ",null,null,null,null,{"$f":"B4","v":"ton"}]
[{"$f":" A2  & IF(C2=\"\",\"\",  \", \" &C2 ) & \", \" & A3 & \", \" & I2","v":"11-Alfalfa, Roundup Ready®, Large and Small Square Bale, Pivot Irrigated"}]
[]
{"$rows_left_out":239}
{"sheet":"12-Alfalfa","index":15,"n_rows":244,"n_cols":15,"rows_kept":244,"cut":false,"hidden":false,"merged":[[65,5,65,6],[69,2,69,4],[69,6,69,7],[70,6,70,7],[55,2,55,4],[56,2,56,4],[57,2,57,4],[58,2,58,4],[59,2,59,4],[60,2,60,4],[54,2,54,4],[43,2,43,4],[44,2,44,4],[45,2,45,4],[46,2,46,4],[47,2,47,4],[48,2,48,4],[49,2,49,4],[50,2,50,4],[51,2,51,4],[52,2,52,4],[53,2,53,4],[42,2,42,4],[34,5,35,5],[34,6,35,6],[34,7,34,8],[34,9,35,9],[37,2,37,4],[38,2,38,4],[39,2,39,4],[40,2,40,4],[41,2,41,4],[4,0,4,11],[34,11,35,11],[36,2,36,4],[6,0,6,11],[9,1,10,1],[9,2,10,2],[9,4,10,4],[9,5,10,5],[9,6,9,7],[9,8,9,9],[9,10,10,10],[9,11,10,11]]}
[]
[{"$f":"REPLACE(CELL(\"filename\",A1),1,FIND(\"]\",CELL(\"filename\",A1)),\"\")","v":"12-Alfalfa"},null,null,null,null,null,null,null,"Pivot Irrigated","800 GPM 35 PSI",null,{"$f":"'General Variables'!A3&\" \"&'General Variables'!B3","v":"Year 2017"},null,null,"Acre"]
["Large and Small Square Bale",null,null,null,null,null,null,16,"acre/inches",null,null,null,null,null,"ai"]
[6.6,"ton",null,null,null,null,null,null,null,"Does Crop Follow a Legume? ",null,null,null,null,{"$f":"B4","v":"ton"}]
[{"$f":" A2  & IF(C2=\"\",\"\",  \", \" &C2 ) & \", \" & A3 & \", \" & I2","v":"12-Alfalfa, Large and Small Square Bale, Pivot Irrigated"}]
[]
{"$rows_left_out":239}
{"sheet":"13-Alfalfa","index":16,"n_rows":244,"n_cols":15,"rows_kept":244,"cut":false,"hidden":false,"merged":[[6,0,6,11],[9,1,10,1],[9,2,10,2],[9,4,10,4],[9,5,10,5],[9,6,9,7],[9,10,10,10],[9,11,10,11],[9,8,9,9],[34,5,35,5],[34,6,35,6],[34,7,34,8],[34,9,35,9],[34,11,35,11],[57,2,57,4],[58,2,58,4],[47,2,47,4],[36,2,36,4],[37,2,37,4],[38,2,38,4],[39,2,39,4],[40,2,40,4],[41,2,41,4],[42,2,42,4],[43,2,43,4],[44,2,44,4],[45,2,45,4],[46,2,46,4],[4,0,4,11],[59,2,59,4],[70,6,70,7],[48,2,48,4],[49,2,49,4],[50,2,50,4],[51,2,51,4],[52,2,52,4],[53,2,53,4],[54,2,54,4],[60,2,60,4],[65,5,65,6],[69,2,69,4],[69,6,69,7],[55,2,55,4],[56,2,56,4]]}
[]
[{"$f":"REPLACE(CELL(\"filename\",A1),1,FIND(\"]\",CELL(\"filename\",A1)),\"\")","v":"13-Alfalfa"},null,null,null,null,null,null,null,"Canal Irrigated",null,null,{"$f":"'General Variables'!A3&\" \"&'General Variables'!B3","v":"Year 2017"},null,null,"Acre"]
["Large Square Bale",null,null,null,null,null,null,22,"acre/inches",null,null,null,null,null,"ai"]
[6.6,"ton",null,null,null,null,null,null,null,"Does Crop Follow a Legume? ",null,null,null,null,{"$f":"B4","v":"ton"}]
[{"$f":" A2  & IF(C2=\"\",\"\",  \", \" &C2 ) & \", \" & A3 & \", \" & I2","v":"13-Alfalfa, Large Square Bale, Canal Irrigated"}]
[]
{"$rows_left_out":239}
{"sheet":"14-Alfalfa","index":17,"n_rows":244,"n_cols":15,"rows_kept":244,"cut":false,"hidden":false,"merged":[[65,5,65,6],[69,2,69,4],[69,6,69,7],[70,6,70,7],[55,2,55,4],[56,2,56,4],[57,2,57,4],[58,2,58,4],[59,2,59,4],[60,2,60,4],[54,2,54,4],[43,2,43,4],[44,2,44,4],[45,2,45,4],[46,2,46,4],[47,2,47,4],[48,2,48,4],[49,2,49,4],[50,2,50,4],[51,2,51,4],[52,2,52,4],[53,2,53,4],[42,2,42,4],[34,5,35,5],[34,6,35,6],[34,7,34,8],[34,9,35,9],[37,2,37,4],[38,2,38,4],[39,2,39,4],[40,2,40,4],[41,2,41,4],[4,0,4,11],[34,11,35,11],[36,2,36,4],[6,0,6,11],[9,1,10,1],[9,2,10,2],[9,4,10,4],[9,5,10,5],[9,6,9,7],[9,8,9,9],[9,10,10,10],[9,11,10,11]]}
[]
[{"$f":"REPLACE(CELL(\"filename\",A1),1,FIND(\"]\",CELL(\"filename\",A1)),\"\")","v":"14-Alfalfa"},null,"Roundup Ready®",null,null,null,null,null,"Canal Irrigated",null,null,{"$f":"'General Variables'!A3&\" \"&'General Variables'!B3","v":"Year 2017"},null,null,"Acre"]
["Large Square Bale",null,null,null,null,null,null,22,"acre/inches",null,null,null,null,null,"ai"]
[6.8,"ton",null,null,null,null,null,null,null,"Does Crop Follow a Legume? ",null,null,null,null,{"$f":"B4","v":"ton"}]
[{"$f":" A2  & IF(C2=\"\",\"\",  \", \" &C2 ) & \", \" & A3 & \", \" & I2","v":"14-Alfalfa, Roundup Ready®, Large Square Bale, Canal Irrigated"}]
[]
{"$rows_left_out":239}
{"sheet":"Stop","index":18,"n_rows":0,"n_cols":0,"rows_kept":0,"cut":false,"hidden":true,"merged":[]}

{"sheet":"Crop after Crop Data","index":19,"n_rows":49,"n_cols":18,"rows_kept":49,"cut":false,"hidden":true,"merged":[]}
[]
[]
[null,"Commodity Prices (Nov. 2009)",null,null,"Source:","Cornhusker economics 12 2 15"]
[null,"Corn after corn",3.44]
[null,"Corn after soybeans",3.44]
[null,"Corn after wheat",3.44]
{"$rows_left_out":44}
{"sheet":"Formulas","index":20,"n_rows":7,"n_cols":10,"rows_kept":7,"cut":false,"hidden":true,"merged":[]}
[]
[]
[null,"Cart","85 bu",{"$f":"IF(B3=0,\"\",'General Variables'!$B$4*VLOOKUP(B3,#REF!,10,FALSE)/VLOOKUP(B3,#REF!,9,FALSE)*LEFT(C3,2))","v":{"$error":"#REF!"}},{"$f":"IF(B3=0,0,IF(VLOOKUP(B3,#REF!,12,FALSE)=0,VLOOKUP(B3,#REF!,13,FALSE)*'General Variables'!$B$8,VLOOKUP(B3,#REF!,12,FALSE)*'General Variables'!$B$7)/VLOOKUP(B3,#REF!,9,FALSE)*LEFT(C3,2))","v":{"$error":"#REF!"}},{"$f":"IF(B3=0,0,VLOOKUP(VLOOKUP(B3,#REF!,11,FALSE),#REF!,10,FALSE)/VLOOKUP(B3,#REF!,9,FALSE)*LEFT(C3,2))","v":{"$error":"#REF!"}},{"$f":"IF(B3=0,\"\",VLOOKUP($B3,#REF!,15,FALSE)*LEFT(C3,2))","v":{"$error":"#REF!"}},{"$f":"IF(B3=0,0,VLOOKUP(VLOOKUP(B3,#REF!,11,FALSE),#REF!,16,FALSE)/VLOOKUP(B3,#REF!,9,FALSE)*LEFT(C3,2))","v":{"$error":"#REF!"}},{"$f":"IF(B3=0,\"\",VLOOKUP($B3,#REF!,21,FALSE)*LEFT(C3,2))","v":{"$error":"#REF!"}},{"$f":"SUM(D3:I3)","v":{"$error":"#REF!"}}]
[null,"Cart","100 bu",{"$f":"IF(B4=0,\"\",'General Variables'!$B$4*VLOOKUP(B4,#REF!,10,FALSE)/VLOOKUP(B4,#REF!,9,FALSE)*LEFT(C4,3))","v":{"$error":"#REF!"}},{"$f":"IF(B4=0,0,IF(VLOOKUP(B4,#REF!,12,FALSE)=0,VLOOKUP(B4,#REF!,13,FALSE)*'General Variables'!$B$8,VLOOKUP(B4,#REF!,12,FALSE)*'General Variables'!$B$7)/VLOOKUP(B4,#REF!,9,FALSE)*LEFT(C4,3))","v":{"$error":"#REF!"}},{"$f":"IF(B4=0,0,VLOOKUP(VLOOKUP(B4,#REF!,11,FALSE),#REF!,10,FALSE)/VLOOKUP(B4,#REF!,9,FALSE)*LEFT(C4,3))","v":{"$error":"#REF!"}},{"$f":"IF(B4=0,\"\",VLOOKUP($B4,#REF!,15,FALSE)*LEFT(C4,3))","v":{"$error":"#REF!"}},{"$f":"IF(B4=0,0,VLOOKUP(VLOOKUP(B4,#REF!,11,FALSE),#REF!,16,FALSE)/VLOOKUP(B4,#REF!,9,FALSE)*LEFT(C4,3))","v":{"$error":"#REF!"}},{"$f":"IF(B4=0,\"\",VLOOKUP($B4,#REF!,21,FALSE)*LEFT(C4,3))","v":{"$error":"#REF!"}},{"$f":"SUM(D4:I4)","v":{"$error":"#REF!"}}]
[null,"Ditch Irrigation","22 AI",{"$f":"IF(B5=0,\"\",'General Variables'!$B$4*VLOOKUP(B5,#REF!,10,FALSE)/VLOOKUP(B5,#REF!,9,FALSE)*LEFT(C5,2))","v":{"$error":"#REF!"}},null,null,null,null,null,{"$f":"SUM(D5:I5)","v":{"$error":"#REF!"}}]
[null,"PivotE 125’Lift","16 AI",{"$f":"IF(B6=0,\"\",'General Variables'!$B$4*VLOOKUP(B6,#REF!,10,FALSE)/VLOOKUP(B6,#REF!,9,FALSE)*LEFT(C6,2))","v":{"$error":"#REF!"}},{"$f":"IF(B6=0,0,IF(VLOOKUP(B6,#REF!,12,FALSE)=0,VLOOKUP(B6,#REF!,13,FALSE)*'General Variables'!$B$8,VLOOKUP(B6,#REF!,12,FALSE)*'General Variables'!$B$7)/VLOOKUP(B6,#REF!,9,FALSE)*LEFT(C6,2))","v":{"$error":"#REF!"}},{"$f":"IF(B6=0,0,VLOOKUP(VLOOKUP(B6,#REF!,11,FALSE),#REF!,10,FALSE)/VLOOKUP(B6,#REF!,9,FALSE)*LEFT(C6,2))","v":{"$error":"#REF!"}},{"$f":"IF(B6=0,\"\",VLOOKUP($B6,#REF!,15,FALSE)*LEFT(C6,2))","v":{"$error":"#REF!"}},{"$f":"IF(B6=0,0,VLOOKUP(VLOOKUP(B6,#REF!,11,FALSE),#REF!,16,FALSE)/VLOOKUP(B6,#REF!,9,FALSE)*LEFT(C6,2))","v":{"$error":"#REF!"}},{"$f":"IF(B6=0,\"\",VLOOKUP($B6,#REF!,21,FALSE)*LEFT(C6,2))","v":{"$error":"#REF!"}},{"$f":"SUM(D6:I6)","v":{"$error":"#REF!"}}]
{"$rows_left_out":2}
{"sheet":"Depreciation Graph","index":21,"n_rows":34,"n_cols":21,"rows_kept":34,"cut":false,"hidden":true,"merged":[]}
[null,null,null,null,null,null,null,null,null,null,null,"Years","Combines","Mowers","Balers","Harvest Other","Plows","Tillage Other","Vehicles","Planters","Misc"]
[null,null,null,null,null,null,null,null,null,null,null,1,{"$f":"(B$33-B$34*$L2^0.5)^2","v":0.93508899999999973},0.47472100000000006,0.56400099999999997,0.4900000000000001,0.47196899999999992,0.60996100000000009,0.52272900000000011,0.64802500000000007,0.69222399999999995]
[null,null,null,null,null,null,null,null,null,null,null,{"$f":"1+L2","v":2},0.80758038163990642,0.43724850927735592,0.50291418906134078,0.4386499871336445,0.44338965987880286,0.54086685750362595,0.48567594563681826,0.59705191021023085,0.61783104757144203]
[null,null,null,null,null,null,null,null,null,null,null,{"$f":"1+L3","v":3},0.71607410032456997,0.40953932499004247,0.45841412781416585,0.40117450164076934,0.42206514340944518,0.49066440070034867,0.45816761622160873,0.55935446535900235,0.56361409163868581]
[null,null,null,null,null,null,null,null,null,null,null,4,0.64320399999999966,0.38688400000000001,0.42249999999999988,0.37088099999999996,0.40449600000000002,0.45024100000000006,0.43560000000000004,0.52852899999999992,0.519841]
[null,null,null,null,null,null,null,null,null,null,null,5,0.58224344632517844,0.36745836960736133,0.39207275680037612,0.34517718182317542,0.38932674692572572,0.41606695505049113,0.4161897717803309,0.50209510823535897,0.4827421131823289]
{"$rows_left_out":28}